Reaction Details
TargetCannabinoid receptor 1
LigandBDBM86891
Substrate/Competitorn/a
Ki 198±n/a nM
CommentsPDSP_8430
Citation Foloppe, NAllen, NHBentley, CHBrooks, TDKennett, GKnight, ARLeonardi, SMisra, AMonck, NJSellwood, DM Discovery of a novel class of selective human CB1 inverse agonists. Bioorg Med Chem Lett18:1199-206 (2008) 
 
Cannabinoid receptor 1
Name:Cannabinoid receptor 1
Type:G Protein-Coupled Receptor (GPCR)
Mol. Mass.:52868.96
Organism:Homo sapiens (Human)
Description:P21554
Residue:472
BDBM86891
NameBDBM86891
Synonyms:5-(3,5-dimethylpiperidin-1-ylsulfonyl)-3-methyl-N-phenethylbenzofuran-2-carboxamide NSC_22422463
TypeSmall organic molecule
Emp. Form.C25H30N2O4S
Mol. Mass.454.582
SMILESCC1CC(C)CN(C1)S(=O)(=O)c1ccc2oc(C(=O)NCCc3ccccc3)c(C)c2c1