Reaction Details
TargetCannabinoid receptor 1
LigandBDBM86881
Substrate/Competitorn/a
Ki 58±n/a nM
CommentsPDSP_8437
Citation Foloppe, NAllen, NHBentley, CHBrooks, TDKennett, GKnight, ARLeonardi, SMisra, AMonck, NJSellwood, DM Discovery of a novel class of selective human CB1 inverse agonists. Bioorg Med Chem Lett18:1199-206 (2008) 
 
Cannabinoid receptor 1
Name:Cannabinoid receptor 1
Type:G Protein-Coupled Receptor (GPCR)
Mol. Mass.:52868.96
Organism:Homo sapiens (Human)
Description:P21554
Residue:472
BDBM86881
NameBDBM86881
Synonyms:CAS_15998383 NSC_15998383
TypeSmall organic molecule
Emp. Form.C25H30N2O5S
Mol. Mass.470.581
SMILESCOc1ccccc1CNC(=O)c1oc2ccc(cc2c1C)S(=O)(=O)N1CC(C)CC(C)C1