Reaction Details
TargetCannabinoid receptor 1
LigandBDBM86884
Substrate/Competitorn/a
Ki 90±n/a nM
CommentsPDSP_8433
Citation Foloppe, NAllen, NHBentley, CHBrooks, TDKennett, GKnight, ARLeonardi, SMisra, AMonck, NJSellwood, DM Discovery of a novel class of selective human CB1 inverse agonists. Bioorg Med Chem Lett18:1199-206 (2008) 
 
Cannabinoid receptor 1
Name:Cannabinoid receptor 1
Type:G Protein-Coupled Receptor (GPCR)
Mol. Mass.:52868.96
Organism:Homo sapiens (Human)
Description:P21554
Residue:472
BDBM86884
NameBDBM86884
Synonyms:CAS_15998702 NSC_15998702
TypeSmall organic molecule
Emp. Form.C22H30N2O4S
Mol. Mass.418.55
SMILESCC1CC(C)CN(C1)S(=O)(=O)c1ccc2oc(C(=O)NC3CCCC3)c(C)c2c1