Reaction Details
TargetCannabinoid receptor 2
LigandBDBM86886
Substrate/Competitorn/a
Ki 6600±n/a nM
CommentsPDSP_8440
Citation Foloppe, NAllen, NHBentley, CHBrooks, TDKennett, GKnight, ARLeonardi, SMisra, AMonck, NJSellwood, DM Discovery of a novel class of selective human CB1 inverse agonists. Bioorg Med Chem Lett18:1199-206 (2008) 
 
Cannabinoid receptor 2
Name:Cannabinoid receptor 2
Type:G Protein-Coupled Receptor (GPCR)
Mol. Mass.:39690.94
Organism:Homo sapiens (Human)
Description:P34972
Residue:360
BDBM86886
NameBDBM86886
Synonyms:CAS_15991674 NSC_15991674
TypeSmall organic molecule
Emp. Form.C24H28N2O4S
Mol. Mass.440.555
SMILESCC1CC(C)CN(C1)S(=O)(=O)c1ccc2oc(C(=O)NCc3ccccc3)c(C)c2c1