Reaction Details
TargetCannabinoid receptor 2
LigandBDBM86880
Substrate/Competitorn/a
Ki 6600±n/a nM
CommentsPDSP_8439
Citation Foloppe, NAllen, NHBentley, CHBrooks, TDKennett, GKnight, ARLeonardi, SMisra, AMonck, NJSellwood, DM Discovery of a novel class of selective human CB1 inverse agonists. Bioorg Med Chem Lett18:1199-206 (2008) 
 
Cannabinoid receptor 2
Name:Cannabinoid receptor 2
Type:G Protein-Coupled Receptor (GPCR)
Mol. Mass.:39690.94
Organism:Homo sapiens (Human)
Description:P34972
Residue:360
BDBM86880
NameBDBM86880
Synonyms:CAS_11496202 NSC_11496202
TypeSmall organic molecule
Emp. Form.C25H30N2O4S
Mol. Mass.454.582
SMILESCC1CC(C)CN(C1)S(=O)(=O)c1ccc2oc(C(=O)N(C)Cc3ccccc3)c(C)c2c1