Reaction Details
TargetDelta-type opioid receptor
LigandBDBM86957
Substrate/Competitorn/a
Ki 11.8±n/a nM
CommentsPDSP_8635
Citation Cunningham, CWMercer, SLHassan, HETraynor, JREddington, NDCoop, A Opioids and efflux transporters. Part 2: P-glycoprotein substrate activity of 3- and 6-substituted morphine analogs. J Med Chem51:2316-20 (2008) 
 
Delta-type opioid receptor
Name:Delta-type opioid receptor
Type:G Protein-Coupled Receptor (GPCR)
Mol. Mass.:40382.98
Organism:Homo sapiens (Human)
Description:Competition binding assays were carried out using membrane preparations from transfected HN9.10 cells that constitutively expressed the delta opioid receptor.
Residue:372
BDBM86957
NameBDBM86957
Synonyms:6-desoxymorphine NSC_44450262
TypeSmall organic molecule
Emp. Form.C17H19NO2
Mol. Mass.269.3383
SMILESCN1CCC23C4CC=CC2C1Cc1ccc(O)c(O4)c31