Reaction Details
TargetDelta-type opioid receptor
LigandBDBM86950
Substrate/Competitorn/a
Ki 65.8±n/a nM
CommentsPDSP_8638
Citation Cunningham, CWMercer, SLHassan, HETraynor, JREddington, NDCoop, A Opioids and efflux transporters. Part 2: P-glycoprotein substrate activity of 3- and 6-substituted morphine analogs. J Med Chem51:2316-20 (2008) 
 
Delta-type opioid receptor
Name:Delta-type opioid receptor
Type:G Protein-Coupled Receptor (GPCR)
Mol. Mass.:40382.98
Organism:Homo sapiens (Human)
Description:Competition binding assays were carried out using membrane preparations from transfected HN9.10 cells that constitutively expressed the delta opioid receptor.
Residue:372
BDBM86950
NameBDBM86950
Synonyms:CAS_5462505 heterocodeine
TypeSmall organic molecule
Emp. Form.C18H21NO3
Mol. Mass.299.3642
SMILESCOC1C=CC2C3Cc4ccc(O)c5OC1C2(CCN3C)c45