Reaction Details
TargetMu-type opioid receptor
LigandBDBM86955
Substrate/Competitorn/a
Ki 122±n/a nM
CommentsPDSP_8639
Citation Cunningham, CWMercer, SLHassan, HETraynor, JREddington, NDCoop, A Opioids and efflux transporters. Part 2: P-glycoprotein substrate activity of 3- and 6-substituted morphine analogs. J Med Chem51:2316-20 (2008) 
 
Mu-type opioid receptor
Name:Mu-type opioid receptor
Type:G Protein-Coupled Receptor (GPCR)
Mol. Mass.:44503.11
Organism:Rattus norvegicus (rat)
Description:Competition binding assays were carried out using membrane preparations from transfected HN9.10 cells that constitutively expressed the mu opioid receptor.
Residue:398
BDBM86955
NameBDBM86955
Synonyms:7,8-dihydro-3-desoxymorphine NSC_16039356
TypeSmall organic molecule
Emp. Form.C17H21NO2
Mol. Mass.271.3541
SMILESCN1CCC23C4Oc5cccc(CC1C2CCC4O)c35