Reaction Details
TargetDelta-type opioid receptor
LigandBDBM86968
Substrate/Competitorn/a
Ki 1500±n/a nM
CommentsPDSP_8566
Citation Le Bourdonnec, BBarker, WMBelanger, SWiant, DDConway-James, NCCassel, JAO'Neill, TJLittle, PJDeHaven, RNDeHaven-Hudkins, DLDolle, RE Novel trans-3,4-dimethyl-4-(3-hydroxyphenyl)piperidines as mu opioid receptor antagonists with improved opioid receptor selectivity profiles. Bioorg Med Chem Lett18:2006-12 (2008) 
 
Delta-type opioid receptor
Name:Delta-type opioid receptor
Type:G Protein-Coupled Receptor (GPCR)
Mol. Mass.:40382.98
Organism:Homo sapiens (Human)
Description:Competition binding assays were carried out using membrane preparations from transfected HN9.10 cells that constitutively expressed the delta opioid receptor.
Residue:372
BDBM86968
NameBDBM86968
Synonyms:(S)-6-amino-2-((S)-2-(((3R,4R)-4-(3-hydroxyphenyl)-3,4-dimethylpiperidin-1-yl)methyl)-3-phenylpropanamido)hexanoic acid NSC_11352435
TypeSmall organic molecule
Emp. Form.C29H41N3O4
Mol. Mass.495.6535
SMILESCC1CN(CC(Cc2ccccc2)C(=O)NC(CCCCN)C(O)=O)CCC1(C)c1cccc(O)c1