Reaction Details
TargetKappa-type opioid receptor
LigandBDBM86970
Substrate/Competitorn/a
Ki 1400±n/a nM
CommentsPDSP_8582
Citation Le Bourdonnec, BBarker, WMBelanger, SWiant, DDConway-James, NCCassel, JAO'Neill, TJLittle, PJDeHaven, RNDeHaven-Hudkins, DLDolle, RE Novel trans-3,4-dimethyl-4-(3-hydroxyphenyl)piperidines as mu opioid receptor antagonists with improved opioid receptor selectivity profiles. Bioorg Med Chem Lett18:2006-12 (2008) 
 
Kappa-type opioid receptor
Name:Kappa-type opioid receptor
Type:G Protein-Coupled Receptor (GPCR)
Mol. Mass.:42648.76
Organism:Homo sapiens (Human)
Description:P41145
Residue:380
BDBM86970
NameBDBM86970
Synonyms:(S)-2-(3-((3R,4R)-4-(3-hydroxyphenyl)-3,4-dimethylpiperidin-1-yl)-N-phenylpropanamido)-3-phenylpropanoic acid NSC_44453879
TypeSmall organic molecule
Emp. Form.C31H36N2O4
Mol. Mass.500.6285
SMILESCC1CN(CCC(=O)N(C(Cc2ccccc2)C(O)=O)c2ccccc2)CCC1(C)c1cccc(O)c1