Reaction Details
TargetKappa-type opioid receptor
LigandBDBM86980
Substrate/Competitorn/a
Ki 550±n/a nM
CommentsPDSP_8581
Citation Le Bourdonnec, BBarker, WMBelanger, SWiant, DDConway-James, NCCassel, JAO'Neill, TJLittle, PJDeHaven, RNDeHaven-Hudkins, DLDolle, RE Novel trans-3,4-dimethyl-4-(3-hydroxyphenyl)piperidines as mu opioid receptor antagonists with improved opioid receptor selectivity profiles. Bioorg Med Chem Lett18:2006-12 (2008) 
 
Kappa-type opioid receptor
Name:Kappa-type opioid receptor
Type:G Protein-Coupled Receptor (GPCR)
Mol. Mass.:42648.76
Organism:Homo sapiens (Human)
Description:P41145
Residue:380
BDBM86980
NameBDBM86980
Synonyms:(S)-2-(N-benzyl-3-((3R,4R)-4-(3-hydroxyphenyl)-3,4-dimethylpiperidin-1-yl)propanamido)-3-phenylpropanoic acid NSC_44453849
TypeSmall organic molecule
Emp. Form.C32H38N2O4
Mol. Mass.514.6551
SMILESCC1CN(CCC(=O)N(Cc2ccccc2)C(Cc2ccccc2)C(O)=O)CCC1(C)c1cccc(O)c1