Reaction Details
TargetKappa-type opioid receptor
LigandBDBM86983
Substrate/Competitorn/a
Ki 720±n/a nM
CommentsPDSP_8571
Citation Le Bourdonnec, BBarker, WMBelanger, SWiant, DDConway-James, NCCassel, JAO'Neill, TJLittle, PJDeHaven, RNDeHaven-Hudkins, DLDolle, RE Novel trans-3,4-dimethyl-4-(3-hydroxyphenyl)piperidines as mu opioid receptor antagonists with improved opioid receptor selectivity profiles. Bioorg Med Chem Lett18:2006-12 (2008) 
 
Kappa-type opioid receptor
Name:Kappa-type opioid receptor
Type:G Protein-Coupled Receptor (GPCR)
Mol. Mass.:42648.76
Organism:Homo sapiens (Human)
Description:P41145
Residue:380
BDBM86983
NameBDBM86983
Synonyms:(S)-3-cyclohexyl-2-((S)-2-(((3R,4R)-4-(3-hydroxyphenyl)-3,4-dimethylpiperidin-1-yl)methyl)-3-phenylpropanamido)propanoic acid NSC_44453726
TypeSmall organic molecule
Emp. Form.C32H44N2O4
Mol. Mass.520.7028
SMILESCC1CN(CC(Cc2ccccc2)C(=O)NC(CC2CCCCC2)C(O)=O)CCC1(C)c1cccc(O)c1