Reaction Details
TargetKappa-type opioid receptor
LigandBDBM86260
Substrate/Competitorn/a
Ki 9.2±n/a nM
CommentsPDSP_2
Citation Le Bourdonnec, BBarker, WMBelanger, SWiant, DDConway-James, NCCassel, JAO'Neill, TJLittle, PJDeHaven, RNDeHaven-Hudkins, DLDolle, RE Novel trans-3,4-dimethyl-4-(3-hydroxyphenyl)piperidines as mu opioid receptor antagonists with improved opioid receptor selectivity profiles. Bioorg Med Chem Lett18:2006-12 (2008) 
 
Kappa-type opioid receptor
Name:Kappa-type opioid receptor
Type:G Protein-Coupled Receptor (GPCR)
Mol. Mass.:42648.76
Organism:Homo sapiens (Human)
Description:P41145
Residue:380
BDBM86260
NameBDBM86260
Synonyms:CAS_465-65-6 NSC_10064 | Naloxone(-)
TypeSmall organic molecule
Emp. Form.C19H21NO4
Mol. Mass.327.3743
SMILESOc1ccc2CC3N(CC=C)CCC45C(Oc1c24)C(=O)CCC35O