Reaction Details
TargetMu-type opioid receptor
LigandBDBM86969
Substrate/Competitorn/a
Ki 2.9±n/a nM
CommentsPDSP_8576
Citation Le Bourdonnec, BBarker, WMBelanger, SWiant, DDConway-James, NCCassel, JAO'Neill, TJLittle, PJDeHaven, RNDeHaven-Hudkins, DLDolle, RE Novel trans-3,4-dimethyl-4-(3-hydroxyphenyl)piperidines as mu opioid receptor antagonists with improved opioid receptor selectivity profiles. Bioorg Med Chem Lett18:2006-12 (2008) 
 
Mu-type opioid receptor
Name:Mu-type opioid receptor
Type:G Protein-Coupled Receptor (GPCR)
Mol. Mass.:44789.51
Organism:Homo sapiens (Human)
Description:P35372
Residue:400
BDBM86969
NameBDBM86969
Synonyms:(R)-2-((S)-2-(((3R,4R)-4-(3-hydroxyphenyl)-3,4-dimethylpiperidin-1-yl)methyl)-3-phenylpropanamido)propanoic acid CAS_44453801 NSC_44453801 | NSC_44453822
TypeSmall organic molecule
Emp. Form.C26H34N2O4
Mol. Mass.438.5592
SMILESCC(NC(=O)C(CN1CCC(C)(C(C)C1)c1cccc(O)c1)Cc1ccccc1)C(O)=O