Reaction Details
TargetMu-type opioid receptor
LigandBDBM86981
Substrate/Competitorn/a
Ki 1.7±n/a nM
CommentsPDSP_8575
Citation Le Bourdonnec, BBarker, WMBelanger, SWiant, DDConway-James, NCCassel, JAO'Neill, TJLittle, PJDeHaven, RNDeHaven-Hudkins, DLDolle, RE Novel trans-3,4-dimethyl-4-(3-hydroxyphenyl)piperidines as mu opioid receptor antagonists with improved opioid receptor selectivity profiles. Bioorg Med Chem Lett18:2006-12 (2008) 
 
Mu-type opioid receptor
Name:Mu-type opioid receptor
Type:G Protein-Coupled Receptor (GPCR)
Mol. Mass.:44789.51
Organism:Homo sapiens (Human)
Description:P35372
Residue:400
BDBM86981
NameBDBM86981
Synonyms:(S)-2-((S)-2-(((3R,4R)-4-(3-hydroxyphenyl)-3,4-dimethylpiperidin-1-yl)methyl)-3-phenylpropanamido)-3-phenylpropanoic acid NSC_11455086
TypeSmall organic molecule
Emp. Form.C32H38N2O4
Mol. Mass.514.6551
SMILESCC1CN(CC(Cc2ccccc2)C(=O)NC(Cc2ccccc2)C(O)=O)CCC1(C)c1cccc(O)c1