Reaction Details
TargetMu-type opioid receptor
LigandBDBM86958
Substrate/Competitorn/a
Ki 20±n/a nM
CommentsPDSP_8589
Citation Le Bourdonnec, BBarker, WMBelanger, SWiant, DDConway-James, NCCassel, JAO'Neill, TJLittle, PJDeHaven, RNDeHaven-Hudkins, DLDolle, RE Novel trans-3,4-dimethyl-4-(3-hydroxyphenyl)piperidines as mu opioid receptor antagonists with improved opioid receptor selectivity profiles. Bioorg Med Chem Lett18:2006-12 (2008) 
 
Mu-type opioid receptor
Name:Mu-type opioid receptor
Type:G Protein-Coupled Receptor (GPCR)
Mol. Mass.:44789.51
Organism:Homo sapiens (Human)
Description:P35372
Residue:400
BDBM86958
NameBDBM86958
Synonyms:(S)-3-cyclohexyl-2-(3-((3R,4R)-4-(3-hydroxyphenyl)-3,4-dimethylpiperidin-1-yl)propanamido)propanoic acid NSC_44453924
TypeSmall organic molecule
Emp. Form.C25H38N2O4
Mol. Mass.430.5802
SMILESCC1CN(CCC(=O)NC(CC2CCCCC2)C(O)=O)CCC1(C)c1cccc(O)c1