Reaction Details
Target5-hydroxytryptamine receptor 5A
LigandBDBM81790
Substrate/Competitorn/a
Ki>10000±n/a nM
CommentsPDSP_287
Citation Abbas, AIHedlund, PBHuang, XPTran, TBMeltzer, HYRoth, BL Amisulpride is a potent 5-HT7 antagonist: relevance for antidepressant actions in vivo. Psychopharmacology (Berl)205:119-28 (2009) 
 
5-hydroxytryptamine receptor 5A
Name:5-hydroxytryptamine receptor 5A
Type:Enzyme
Mol. Mass.:40266.25
Organism:Homo sapiens (Human)
Description:P47898
Residue:357
BDBM81790
NameBDBM81790
Synonyms:Amisulpride NSC_2159 US10259786, Amisulpride
TypeSmall organic molecule
Emp. Form.C17H27N3O4S
Mol. Mass.369.479
SMILESCCN1CCCC1CNC(=O)c1cc(c(N)cc1OC)S(=O)(=O)CC