Reaction Details
TargetMuscarinic acetylcholine receptor M1
LigandBDBM81790
Substrate/Competitorn/a
Ki>10000±n/a nM
CommentsPDSP_287
Citation Abbas, AIHedlund, PBHuang, XPTran, TBMeltzer, HYRoth, BL Amisulpride is a potent 5-HT7 antagonist: relevance for antidepressant actions in vivo. Psychopharmacology (Berl)205:119-28 (2009) 
 
Muscarinic acetylcholine receptor M1
Name:Muscarinic acetylcholine receptor M1
Type:Protein
Mol. Mass.:51442.54
Organism:Homo sapiens (Human)
Description:P11229
Residue:460
BDBM81790
NameBDBM81790
Synonyms:Amisulpride NSC_2159 US10259786, Amisulpride
TypeSmall organic molecule
Emp. Form.C17H27N3O4S
Mol. Mass.369.479
SMILESCCN1CCCC1CNC(=O)c1cc(c(N)cc1OC)S(=O)(=O)CC