Reaction Details
TargetPhospholipase D2
LigandBDBM50258131
Substrate/Competitorn/a
Meas. Tech.Cellular PLD2 concentration response
IC50 97±n/a nM
Citation PubChem, PC Cellular PLD2 concentration response PubChem Bioassay(2011)[AID]
 
Phospholipase D2
Name:Phospholipase D2
Type:Protein
Mol. Mass.:106002.47
Organism:Homo sapiens (Human)
Description:n/a
Residue:933
BDBM50258131
NameBDBM50258131
Synonyms:CHEMBL492561 cid_44573690
TypeSmall organic molecule
Emp. Form.C21H22BrClN4O2
Mol. Mass.477.782
SMILESClc1ccc(cc1)C(=O)NCCN1CCC(CC1)n1c2ccc(Br)cc2[nH]c1=O