Reaction Details
TargetPhospholipase D1
LigandBDBM87127
Substrate/Competitorn/a
Meas. Tech.Cellular PLD1 concentration response
IC50 5±n/a nM
Citation PubChem, PC Cellular PLD1 concentration response PubChem Bioassay(2011)[AID]
 
Phospholipase D1
Name:Phospholipase D1
Type:Protein
Mol. Mass.:124219.92
Organism:Homo sapiens (Human)
Description:Q13393
Residue:1074
BDBM87127
NameBDBM87127
Synonyms:4-chloranyl-N-[2-[4-(5-iodanyl-2-oxidanylidene-3H-benzimidazol-1-yl)piperidin-1-yl]ethyl]benzamide;2,2,2-tris(fluoranyl)ethanoic acid 4-chloro-N-[2-[4-(5-iodo-2-oxo-3H-benzimidazol-1-yl)-1-piperidinyl]ethyl]benzamide;2,2,2-trifluoroacetic acid VU0409795-1 | cid_53469889
TypeSmall organic molecule
Emp. Form.C21H22ClIN4O2
Mol. Mass.524.782
SMILESClc1ccc(cc1)C(=O)NCCN1CCC(CC1)n1c2ccc(I)cc2[nH]c1=O