Reaction Details
TargetPhospholipase D1
LigandBDBM87201
Substrate/Competitorn/a
Meas. Tech.Cellular PLD1 concentration response
IC50 2±n/a nM
Citation PubChem, PC Cellular PLD1 concentration response PubChem Bioassay(2011)[AID]
 
Phospholipase D1
Name:Phospholipase D1
Type:Protein
Mol. Mass.:124219.92
Organism:Homo sapiens (Human)
Description:Q13393
Residue:1074
BDBM87201
NameBDBM87201
Synonyms:N-[(1S)-2-[4-(2-keto-3H-benzimidazol-1-yl)piperidino]-1-methyl-ethyl]-2-phenoxy-acetamide;2,2,2-trifluoroacetic acid N-[(2S)-1-[4-(2-oxo-3H-benzimidazol-1-yl)-1-piperidinyl]propan-2-yl]-2-phenoxyacetamide;2,2,2-trifluoroacetic acid VU0360250-1 | cid_53470169
TypeSmall organic molecule
Emp. Form.C23H28N4O3
Mol. Mass.408.4934
SMILESC[C@@H](CN1CCC(CC1)n1c2ccccc2[nH]c1=O)NC(=O)COc1ccccc1