Reaction Details
TargetPhospholipase D1
LigandBDBM87211
Substrate/Competitorn/a
Meas. Tech.Cellular PLD1 concentration response
IC50 4±n/a nM
Citation PubChem, PC Cellular PLD1 concentration response PubChem Bioassay(2011)[AID]
 
Phospholipase D1
Name:Phospholipase D1
Type:Protein
Mol. Mass.:124219.92
Organism:Homo sapiens (Human)
Description:Q13393
Residue:1074
BDBM87211
NameBDBM87211
Synonyms:N-[(1S)-2-[4-(5-bromo-2-keto-3H-benzimidazol-1-yl)piperidino]-1-methyl-ethyl]-4-chloro-benzamide;2,2,2-trifluoroacetic acid N-[(2S)-1-[4-(5-bromo-2-oxo-3H-benzimidazol-1-yl)-1-piperidinyl]propan-2-yl]-4-chlorobenzamide;2,2,2-trifluoroacetic acid VU0359591-1 | cid_53470188
TypeSmall organic molecule
Emp. Form.C22H24BrClN4O2
Mol. Mass.491.809
SMILESC[C@@H](CN1CCC(CC1)n1c2ccc(Br)cc2[nH]c1=O)NC(=O)c1ccc(Cl)cc1