Reaction Details
TargetPhospholipase D1
LigandBDBM50258084
Substrate/Competitorn/a
Meas. Tech.Cellular PLD1 concentration response
IC50 1±n/a nM
Citation PubChem, PC Cellular PLD1 concentration response PubChem Bioassay(2011)[AID]
 
Phospholipase D1
Name:Phospholipase D1
Type:Protein
Mol. Mass.:124219.92
Organism:Homo sapiens (Human)
Description:Q13393
Residue:1074
BDBM50258084
NameBDBM50258084
Synonyms:(1R,2R)-N-(2-(4-(5-chloro-2-oxo-2,3-dihydro-1H-benzo[d]imidazol-1-yl)piperidin-1-yl)ethyl)-2-phenylcyclopropanecarboxamide cid_44573642
TypeSmall organic molecule
Emp. Form.C24H27ClN4O2
Mol. Mass.438.95
SMILESClc1ccc2n(C3CCN(CCNC(=O)C4C[C@H]4c4ccccc4)CC3)c(=O)[nH]c2c1