Reaction Details
TargetPhospholipase D1
LigandBDBM50258180
Substrate/Competitorn/a
Meas. Tech.Cellular PLD1 concentration response
IC50 7±n/a nM
Citation PubChem, PC Cellular PLD1 concentration response PubChem Bioassay(2011)[AID]
 
Phospholipase D1
Name:Phospholipase D1
Type:Protein
Mol. Mass.:124219.92
Organism:Homo sapiens (Human)
Description:Q13393
Residue:1074
BDBM50258180
NameBDBM50258180
Synonyms:4-chloro-N-(2-(4-(6-fluoro-2-oxo-2,3-dihydro-1H-benzo[d]imidazol-1-yl)piperidin-1-yl)ethyl)benzamide cid_44573727
TypeSmall organic molecule
Emp. Form.C21H22ClFN4O2
Mol. Mass.416.876
SMILESFc1ccc2[nH]c(=O)n(C3CCN(CCNC(=O)c4ccc(Cl)cc4)CC3)c2c1