Reaction Details
TargetTegument protein VP16
LigandBDBM39195
Substrate/Competitorn/a
Meas. Tech.Counterscreen for inhibitors of the Steroid Receptor Coactivator 3 (SRC3; NCOA3)
IC50 5728±n/a nM
Citation PubChem, PC Counterscreen for inhibitors of the Steroid Receptor Coactivator 3 (SRC3; NCOA3): Luminescence-based cell-based high throughput dose response assay to identify inhibitors of the Herpes Virus Virion Protein 16 (VP16) PubChem Bioassay(2012)[AID]
 
Tegument protein VP16
Name:Tegument protein VP16
Type:PROTEIN
Mol. Mass.:54325.13
Organism:Human herpesvirus 1 (strain 17) (HHV-1) (Human herpes simplex virus1)
Description:EBI_100271
Residue:490
BDBM39195
NameBDBM39195
Synonyms:(9Z)-9-hydroximinofluorene-4-carboxylic acid methyl ester 9-hydroximinofluorene-4-carboxylic acid methyl ester MLS000070237 cid_6398908 | methyl 9-hydroxyiminofluorene-4-carboxylate
TypeSmall organic molecule
Emp. Form.C15H11NO3
Mol. Mass.253.2527
SMILESCOC(=O)c1cccc2C(N=O)c3ccccc3-c12