Reaction Details
TargetTegument protein VP16
LigandBDBM50224397
Substrate/Competitorn/a
Meas. Tech.Counterscreen for inhibitors of the Steroid Receptor Coactivator 3 (SRC3; NCOA3)
IC50 14249±n/a nM
Citation PubChem, PC Counterscreen for inhibitors of the Steroid Receptor Coactivator 3 (SRC3; NCOA3): Luminescence-based cell-based high throughput dose response assay to identify inhibitors of the Herpes Virus Virion Protein 16 (VP16) PubChem Bioassay(2012)[AID]
 
Tegument protein VP16
Name:Tegument protein VP16
Type:PROTEIN
Mol. Mass.:54325.13
Organism:Human herpesvirus 1 (strain 17) (HHV-1) (Human herpes simplex virus1)
Description:EBI_100271
Residue:490
BDBM50224397
NameBDBM50224397
Synonyms:9-dimethylamino-3-(4-methoxy-phenyl)-3H-pyrido[3',2':4,5]thieno[3,2-d]pyrimidin-4-one cid_1208332
TypeSmall organic molecule
Emp. Form.C18H16N4O2S
Mol. Mass.352.41
SMILESCOc1ccc(cc1)-n1cnc2c(sc3nccc(N(C)C)c23)c1=O