Reaction Details
TargetTegument protein VP16
LigandBDBM87286
Substrate/Competitorn/a
Meas. Tech.Counterscreen for inhibitors of the Steroid Receptor Coactivator 3 (SRC3; NCOA3)
IC50 7445±n/a nM
Citation PubChem, PC Counterscreen for inhibitors of the Steroid Receptor Coactivator 3 (SRC3; NCOA3): Luminescence-based cell-based high throughput dose response assay to identify inhibitors of the Herpes Virus Virion Protein 16 (VP16) PubChem Bioassay(2012)[AID]
 
Tegument protein VP16
Name:Tegument protein VP16
Type:PROTEIN
Mol. Mass.:54325.13
Organism:Human herpesvirus 1 (strain 17) (HHV-1) (Human herpes simplex virus1)
Description:EBI_100271
Residue:490
BDBM87286
NameBDBM87286
Synonyms:4-(2-fluorophenyl)-3-(3-imidazol-1-ylpropyl)-N-pyridin-3-yl-1,3-thiazol-2-imine MLS000418005 [4-(2-fluorophenyl)-3-(3-imidazol-1-ylpropyl)-4-thiazolin-2-ylidene]-(3-pyridyl)amine | cid_4216155
TypeSmall organic molecule
Emp. Form.C20H18FN5S
Mol. Mass.379.454
SMILESFc1ccccc1-c1cs\c(=N/c2cccnc2)n1CCCn1ccnc1