Reaction Details
TargetTegument protein VP16
LigandBDBM87294
Substrate/Competitorn/a
Meas. Tech.Counterscreen for inhibitors of the Steroid Receptor Coactivator 3 (SRC3; NCOA3)
IC50 7729±n/a nM
Citation PubChem, PC Counterscreen for inhibitors of the Steroid Receptor Coactivator 3 (SRC3; NCOA3): Luminescence-based cell-based high throughput dose response assay to identify inhibitors of the Herpes Virus Virion Protein 16 (VP16) PubChem Bioassay(2012)[AID]
 
Tegument protein VP16
Name:Tegument protein VP16
Type:PROTEIN
Mol. Mass.:54325.13
Organism:Human herpesvirus 1 (strain 17) (HHV-1) (Human herpes simplex virus1)
Description:EBI_100271
Residue:490
BDBM87294
NameBDBM87294
Synonyms:MLS000729024 N-[4-[2-(3,4-diethoxyphenyl)ethanoylamino]phenyl]furan-2-carboxamide N-[4-[[2-(3,4-diethoxyphenyl)acetyl]amino]phenyl]-2-furamide SMR000307302 | cid_1503622
TypeSmall organic molecule
Emp. Form.C23H24N2O5
Mol. Mass.408.4471
SMILESCCOc1ccc(CC(=O)Nc2ccc(NC(=O)c3ccco3)cc2)cc1OCC