Reaction Details
TargetTegument protein VP16
LigandBDBM58327
Substrate/Competitorn/a
Meas. Tech.Counterscreen for inhibitors of the Steroid Receptor Coactivator 3 (SRC3; NCOA3)
IC50 4397±n/a nM
Citation PubChem, PC Counterscreen for inhibitors of the Steroid Receptor Coactivator 3 (SRC3; NCOA3): Luminescence-based cell-based high throughput dose response assay to identify inhibitors of the Herpes Virus Virion Protein 16 (VP16) PubChem Bioassay(2012)[AID]
 
Tegument protein VP16
Name:Tegument protein VP16
Type:PROTEIN
Mol. Mass.:54325.13
Organism:Human herpesvirus 1 (strain 17) (HHV-1) (Human herpes simplex virus1)
Description:EBI_100271
Residue:490
BDBM58327
NameBDBM58327
Synonyms:MLS001204085 N-[(4-chlorophenyl)-(8-hydroxy-7-quinolinyl)methyl]butanamide N-[(4-chlorophenyl)-(8-hydroxyquinolin-7-yl)methyl]butanamide SMR000516562 | cid_2876611
TypeSmall organic molecule
Emp. Form.C20H19ClN2O2
Mol. Mass.354.83
SMILESCCCC(=O)NC(c1ccc(Cl)cc1)c1ccc2cccnc2c1O