Reaction Details
TargetTegument protein VP16
LigandBDBM59548
Substrate/Competitorn/a
Meas. Tech.Counterscreen for inhibitors of the Steroid Receptor Coactivator 3 (SRC3; NCOA3)
IC50 1199±n/a nM
Citation PubChem, PC Counterscreen for inhibitors of the Steroid Receptor Coactivator 3 (SRC3; NCOA3): Luminescence-based cell-based high throughput dose response assay to identify inhibitors of the Herpes Virus Virion Protein 16 (VP16) PubChem Bioassay(2012)[AID]
 
Tegument protein VP16
Name:Tegument protein VP16
Type:PROTEIN
Mol. Mass.:54325.13
Organism:Human herpesvirus 1 (strain 17) (HHV-1) (Human herpes simplex virus1)
Description:EBI_100271
Residue:490
BDBM59548
NameBDBM59548
Synonyms:3-(4-chlorophenyl)-6-(4-fluorophenyl)-5-methyl-7-pyrazolo[1,5-a]pyrimidinamine 3-(4-chlorophenyl)-6-(4-fluorophenyl)-5-methylpyrazolo[1,5-a]pyrimidin-7-amine SMR000550192 cid_1474387
TypeSmall organic molecule
Emp. Form.C19H14ClFN4
Mol. Mass.352.793
SMILESCc1nc2c(cnn2c(N)c1-c1ccc(F)cc1)-c1ccc(Cl)cc1