Reaction Details
TargetBotulinum neurotoxin type F
LigandBDBM3588
Substrate/Competitorn/a
Meas. Tech.High-throughput multiplex microsphere dose response for inhibitors of toxin protease, specifically Botulinum neurotoxin light chain F protease, compounds from Cherry Pick 01
EC50>20000±n/a nM
Citation PubChem, PC High-throughput multiplex microsphere dose response for inhibitors of toxin protease, specifically Botulinum neurotoxin light chain F protease, compounds from Cherry Pick 01 PubChem Bioassay(2012)[AID]
 
Botulinum neurotoxin type F
Name:Botulinum neurotoxin type F
Type:Enzyme Catalytic Domain
Mol. Mass.:146691.56
Organism:Clostridium botulinum Bf
Description:P30996
Residue:1274
BDBM3588
NameBDBM3588
Synonyms:cid_2817441
Typen/a
Emp. Form.C16H8ClNO2
Mol. Mass.281.693
SMILESClc1c2oc3ccccc3nc2c2ccccc2c1=O