Reaction Details
TargetBotulinum neurotoxin type F
LigandBDBM50282
Substrate/Competitorn/a
Meas. Tech.High-throughput multiplex microsphere dose response for inhibitors of toxin protease, specifically Botulinum neurotoxin light chain F protease, compounds from Cherry Pick 01
EC50>20000±n/a nM
Citation PubChem, PC High-throughput multiplex microsphere dose response for inhibitors of toxin protease, specifically Botulinum neurotoxin light chain F protease, compounds from Cherry Pick 01 PubChem Bioassay(2012)[AID]
 
Botulinum neurotoxin type F
Name:Botulinum neurotoxin type F
Type:Enzyme Catalytic Domain
Mol. Mass.:146691.56
Organism:Clostridium botulinum Bf
Description:P30996
Residue:1274
BDBM50282
NameBDBM50282
Synonyms:MLS000418506 N-phenazin-2-ylbenzamide cid_5110696
TypeSmall organic molecule
Emp. Form.C19H13N3O
Mol. Mass.299.326
SMILESO=C(Nc1ccc2nc3ccccc3nc2c1)c1ccccc1