Reaction Details
TargetBotulinum neurotoxin type F
LigandBDBM1718
Substrate/Competitorn/a
Meas. Tech.High-throughput multiplex microsphere dose response for inhibitors of toxin protease, specifically Botulinum neurotoxin light chain F protease, compounds from Cherry Pick 01
EC50>20000±n/a nM
Citation PubChem, PC High-throughput multiplex microsphere dose response for inhibitors of toxin protease, specifically Botulinum neurotoxin light chain F protease, compounds from Cherry Pick 01 PubChem Bioassay(2012)[AID]
 
Botulinum neurotoxin type F
Name:Botulinum neurotoxin type F
Type:Enzyme Catalytic Domain
Mol. Mass.:146691.56
Organism:Clostridium botulinum Bf
Description:P30996
Residue:1274
BDBM1718
NameBDBM1718
Synonyms:cid_1829912
Typen/a
Emp. Form.C26H20N2O2
Mol. Mass.392.4492
SMILESCOc1ccc(OC)c(c1)-c1nc2cc3ccccc3cc2nc1-c1ccccc1