Reaction Details
TargetBotulinum neurotoxin type F
LigandBDBM1775
Substrate/Competitorn/a
Meas. Tech.High-throughput multiplex microsphere dose response for inhibitors of toxin protease, specifically Botulinum neurotoxin light chain F protease, compounds from Cherry Pick 01
EC50>20000±n/a nM
Citation PubChem, PC High-throughput multiplex microsphere dose response for inhibitors of toxin protease, specifically Botulinum neurotoxin light chain F protease, compounds from Cherry Pick 01 PubChem Bioassay(2012)[AID]
 
Botulinum neurotoxin type F
Name:Botulinum neurotoxin type F
Type:Enzyme Catalytic Domain
Mol. Mass.:146691.56
Organism:Clostridium botulinum Bf
Description:P30996
Residue:1274
BDBM1775
NameBDBM1775
Synonyms:cid_12006136
Typen/a
Emp. Form.C22H20N2OS3
Mol. Mass.424.602
SMILESCCOCCSc1nc2\C(CCc2c(-c2cccs2)c1C#N)=C/c1cccs1