Reaction Details
TargetBotulinum neurotoxin type F
LigandBDBM44521
Substrate/Competitorn/a
Meas. Tech.High-throughput multiplex microsphere dose response for inhibitors of toxin protease, specifically Botulinum neurotoxin light chain F protease, compounds from Cherry Pick 01
EC50>20000±n/a nM
Citation PubChem, PC High-throughput multiplex microsphere dose response for inhibitors of toxin protease, specifically Botulinum neurotoxin light chain F protease, compounds from Cherry Pick 01 PubChem Bioassay(2012)[AID]
 
Botulinum neurotoxin type F
Name:Botulinum neurotoxin type F
Type:Enzyme Catalytic Domain
Mol. Mass.:146691.56
Organism:Clostridium botulinum Bf
Description:P30996
Residue:1274
BDBM44521
NameBDBM44521
Synonyms:2,3,6-triphenylimidazo[1,2-b][1,2,4]triazine SMR000184539 | cid_702952
TypeSmall organic molecule
Emp. Form.C23H16N4
Mol. Mass.348.3999
SMILESc1c(nc2nc(-c3ccccc3)c(nn12)-c1ccccc1)-c1ccccc1