Reaction Details
TargetBotulinum neurotoxin type F
LigandBDBM1712
Substrate/Competitorn/a
Meas. Tech.High-throughput multiplex microsphere dose response for inhibitors of toxin protease, specifically Botulinum neurotoxin light chain F protease, compounds from Cherry Pick 01
EC50>20000±n/a nM
Citation PubChem, PC High-throughput multiplex microsphere dose response for inhibitors of toxin protease, specifically Botulinum neurotoxin light chain F protease, compounds from Cherry Pick 01 PubChem Bioassay(2012)[AID]
 
Botulinum neurotoxin type F
Name:Botulinum neurotoxin type F
Type:Enzyme Catalytic Domain
Mol. Mass.:146691.56
Organism:Clostridium botulinum Bf
Description:P30996
Residue:1274
BDBM1712
NameBDBM1712
Synonyms:cid_9549736
Typen/a
Emp. Form.C13H13N5S
Mol. Mass.271.341
SMILESCSc1nnc2n(nc(C)c2n1)-c1cccc(C)c1