Reaction Details
TargetBotulinum neurotoxin type F
LigandBDBM61118
Substrate/Competitorn/a
Meas. Tech.High-throughput multiplex microsphere dose response for inhibitors of toxin protease, specifically Botulinum neurotoxin light chain F protease, compounds from Cherry Pick 01
EC50 1800±n/a nM
Citation PubChem, PC High-throughput multiplex microsphere dose response for inhibitors of toxin protease, specifically Botulinum neurotoxin light chain F protease, compounds from Cherry Pick 01 PubChem Bioassay(2012)[AID]
 
Botulinum neurotoxin type F
Name:Botulinum neurotoxin type F
Type:Enzyme Catalytic Domain
Mol. Mass.:146691.56
Organism:Clostridium botulinum Bf
Description:P30996
Residue:1274
BDBM61118
NameBDBM61118
Synonyms:1-(2-Methoxy-phenyl)-3-(4-nitro-phenyl)-5-phenyl-4,5-dihydro-1H-pyrazole 2-(2-methoxyphenyl)-5-(4-nitrophenyl)-3-phenyl-3,4-dihydropyrazole SMR000515423 | cid_2865835
TypeSmall organic molecule
Emp. Form.C22H19N3O3
Mol. Mass.373.4046
SMILESCOc1ccccc1[N+]1=N[C-](CC1c1ccccc1)c1ccc(cc1)[N+]([O-])=O