Reaction Details
TargetBotulinum neurotoxin type F
LigandBDBM31372
Substrate/Competitorn/a
Meas. Tech.High-throughput multiplex microsphere dose response for inhibitors of toxin protease, specifically Botulinum neurotoxin light chain F protease, compounds from Cherry Pick 01
EC50 1500±n/a nM
Citation PubChem, PC High-throughput multiplex microsphere dose response for inhibitors of toxin protease, specifically Botulinum neurotoxin light chain F protease, compounds from Cherry Pick 01 PubChem Bioassay(2012)[AID]
 
Botulinum neurotoxin type F
Name:Botulinum neurotoxin type F
Type:Enzyme Catalytic Domain
Mol. Mass.:146691.56
Organism:Clostridium botulinum Bf
Description:P30996
Residue:1274
BDBM31372
NameBDBM31372
Synonyms:3-(2-furanyl)-5-(4-nitrophenyl)-2-phenyl-3,4-dihydropyrazole 5-(2-furyl)-3-(4-nitrophenyl)-1-phenyl-2-pyrazoline MLS000861141 cid_564008
TypeSmall organic molecule
Emp. Form.C19H15N3O3
Mol. Mass.333.3407
SMILES[O-][N+](=O)c1ccc(cc1)C1=NN(C(C1)c1ccco1)c1ccccc1