Reaction Details
TargetBotulinum neurotoxin type F
LigandBDBM50876
Substrate/Competitorn/a
Meas. Tech.High-throughput multiplex microsphere dose response for inhibitors of toxin protease, specifically Botulinum neurotoxin light chain F protease, compounds from Cherry Pick 01
EC50>20000±n/a nM
Citation PubChem, PC High-throughput multiplex microsphere dose response for inhibitors of toxin protease, specifically Botulinum neurotoxin light chain F protease, compounds from Cherry Pick 01 PubChem Bioassay(2012)[AID]
 
Botulinum neurotoxin type F
Name:Botulinum neurotoxin type F
Type:Enzyme Catalytic Domain
Mol. Mass.:146691.56
Organism:Clostridium botulinum Bf
Description:P30996
Residue:1274
BDBM50876
NameBDBM50876
Synonyms:(3Z)-3-phenacylidene-1-phenyl-4H-quinoxalin-2-one MLS000533709 cid_5658596
TypeSmall organic molecule
Emp. Form.C22H16N2O2
Mol. Mass.340.3746
SMILESO=C(Cc1nc2ccccc2n(-c2ccccc2)c1=O)c1ccccc1