Reaction Details
TargetBotulinum neurotoxin type F
LigandBDBM1715
Substrate/Competitorn/a
Meas. Tech.High-throughput multiplex microsphere dose response for inhibitors of toxin protease, specifically Botulinum neurotoxin light chain F protease, compounds from Cherry Pick 01
EC50>20000±n/a nM
Citation PubChem, PC High-throughput multiplex microsphere dose response for inhibitors of toxin protease, specifically Botulinum neurotoxin light chain F protease, compounds from Cherry Pick 01 PubChem Bioassay(2012)[AID]
 
Botulinum neurotoxin type F
Name:Botulinum neurotoxin type F
Type:Enzyme Catalytic Domain
Mol. Mass.:146691.56
Organism:Clostridium botulinum Bf
Description:P30996
Residue:1274
BDBM1715
NameBDBM1715
Synonyms:cid_1299052
Typen/a
Emp. Form.C20H16N4OS2
Mol. Mass.392.497
SMILESO=C(NC1CC1)Nc1ccc2nc(-c3cccs3)c(nc2c1)-c1cccs1