Reaction Details
TargetBotulinum neurotoxin type F
LigandBDBM44497
Substrate/Competitorn/a
Meas. Tech.High-throughput multiplex microsphere dose response for inhibitors of toxin protease, specifically Botulinum neurotoxin light chain F protease, compounds from Cherry Pick 01
EC50>20000±n/a nM
Citation PubChem, PC High-throughput multiplex microsphere dose response for inhibitors of toxin protease, specifically Botulinum neurotoxin light chain F protease, compounds from Cherry Pick 01 PubChem Bioassay(2012)[AID]
 
Botulinum neurotoxin type F
Name:Botulinum neurotoxin type F
Type:Enzyme Catalytic Domain
Mol. Mass.:146691.56
Organism:Clostridium botulinum Bf
Description:P30996
Residue:1274
BDBM44497
NameBDBM44497
Synonyms:6-(5-ethylsulfanyl-1,3,4-oxadiazol-2-yl)-3,4-diphenyl-thieno[2,3-c]pyridazin-5-amine 6-[5-(ethylsulfanyl)-1,3,4-oxadiazol-2-yl]-3,4-diphenylthieno[2,3-c]pyridazin-5-amine MLS000545814 [6-[5-(ethylthio)-1,3,4-oxadiazol-2-yl]-3,4-diphenyl-thieno[2,3-c]pyridazin-5-yl]amine | cid_6406850
TypeSmall organic molecule
Emp. Form.C22H17N5OS2
Mol. Mass.431.533
SMILESCCSc1nnc(o1)-c1sc2nnc(-c3ccccc3)c(-c3ccccc3)c2c1N