Reaction Details
TargetBotulinum neurotoxin type F
LigandBDBM3645
Substrate/Competitorn/a
Meas. Tech.High-throughput multiplex microsphere dose response for inhibitors of toxin protease, specifically Botulinum neurotoxin light chain F protease, compounds from Cherry Pick 01
EC50 3900±n/a nM
Citation PubChem, PC High-throughput multiplex microsphere dose response for inhibitors of toxin protease, specifically Botulinum neurotoxin light chain F protease, compounds from Cherry Pick 01 PubChem Bioassay(2012)[AID]
 
Botulinum neurotoxin type F
Name:Botulinum neurotoxin type F
Type:Enzyme Catalytic Domain
Mol. Mass.:146691.56
Organism:Clostridium botulinum Bf
Description:P30996
Residue:1274
BDBM3645
NameBDBM3645
Synonyms:cid_3095057
Typen/a
Emp. Form.C11H7N5O7
Mol. Mass.321.2026
SMILES[O-][N+](=O)c1cc(cc(c1)[N+]([O-])=O)C(=O)Nc1c[nH]c(=O)[nH]c1=O