Reaction Details
TargetBotulinum neurotoxin type F
LigandBDBM38452
Substrate/Competitorn/a
Meas. Tech.High-throughput multiplex microsphere dose response for inhibitors of toxin protease, specifically Botulinum neurotoxin light chain F protease, compounds from Cherry Pick 01
EC50>20000±n/a nM
Citation PubChem, PC High-throughput multiplex microsphere dose response for inhibitors of toxin protease, specifically Botulinum neurotoxin light chain F protease, compounds from Cherry Pick 01 PubChem Bioassay(2012)[AID]
 
Botulinum neurotoxin type F
Name:Botulinum neurotoxin type F
Type:Enzyme Catalytic Domain
Mol. Mass.:146691.56
Organism:Clostridium botulinum Bf
Description:P30996
Residue:1274
BDBM38452
NameBDBM38452
Synonyms:MLS000050299 N-(2,3-dithiophen-2-yl-6-quinoxalinyl)-4-morpholinecarboxamide N-[2,3-bis(2-thienyl)quinoxalin-6-yl]morpholine-4-carboxamide cid_2214213
TypeSmall organic molecule
Emp. Form.C21H18N4O2S2
Mol. Mass.422.523
SMILESO=C(Nc1ccc2nc(-c3cccs3)c(nc2c1)-c1cccs1)N1CCOCC1