Reaction Details
TargetBotulinum neurotoxin type F
LigandBDBM50999
Substrate/Competitorn/a
Meas. Tech.High-throughput multiplex microsphere dose response for inhibitors of toxin protease, specifically Botulinum neurotoxin light chain F protease, compounds from Cherry Pick 01
EC50>20000±n/a nM
Citation PubChem, PC High-throughput multiplex microsphere dose response for inhibitors of toxin protease, specifically Botulinum neurotoxin light chain F protease, compounds from Cherry Pick 01 PubChem Bioassay(2012)[AID]
 
Botulinum neurotoxin type F
Name:Botulinum neurotoxin type F
Type:Enzyme Catalytic Domain
Mol. Mass.:146691.56
Organism:Clostridium botulinum Bf
Description:P30996
Residue:1274
BDBM50999
NameBDBM50999
Synonyms:3-(1,3-benzodioxol-5-yl)-2-methylsulfonyl-5-phenyl-3,4-dihydropyrazole 5-Benzo[1,3]dioxol-5-yl-1-methanesulfonyl-3-phenyl-4,5-dihydro-1H-pyrazole SMR000172323 | cid_3153499
TypeSmall organic molecule
Emp. Form.C17H16N2O4S
Mol. Mass.344.385
SMILESCS(=O)(=O)N1N=C(CC1c1ccc2OCOc2c1)c1ccccc1