Reaction Details
TargetTyrosine-protein kinase ABL1
LigandBDBM12
Substrate/Competitorn/a
Meas. Tech.TRFRET-based biochemical high throughput dose response assay for inhibitors of the interaction of the Ras and Rab interactor 1 protein (Rin1) and the c-abl oncogene 1
IC50>3.73±n/a nM
Citation PubChem, PC TRFRET-based biochemical high throughput dose response assay for inhibitors of the interaction of the Ras and Rab interactor 1 protein (Rin1) and the c-abl oncogene 1, non-receptor tyrosine kinase (Abl) PubChem Bioassay(2012)[AID]
 
Tyrosine-protein kinase ABL1
Name:Tyrosine-protein kinase ABL1
Type:Enzyme
Mol. Mass.:122897.30
Organism:Homo sapiens (Human)
Description:P00519
Residue:1130
BDBM12
NameBDBM12
Synonyms:5-[(3aS,4S,6aR)-2-oxo-hexahydro-1H-thieno[3,4-d]imidazolidin-4-yl]pentanoic acid cid_171548 | cid_253
TypeEnzyme co-factor
Emp. Form.C10H16N2O3S
Mol. Mass.244.311
SMILES[H][C@]12CS[C@@H](CCCCC(O)=O)[C@@]1([H])NC(=O)N2