Reaction Details
TargetHigh affinity choline transporter 1
LigandBDBM87573
Substrate/Competitorn/a
Meas. Tech.JHICC_CHT_Inh_3H uptake_CRC
IC50 12788.0182±n/a nM
Citation PubChem, PC JHICC_CHT_Inh_3H uptake_CRC PubChem Bioassay(2012)[AID]
 
High affinity choline transporter 1
Name:High affinity choline transporter 1
Type:PROTEIN
Mol. Mass.:63194.33
Organism:Homo sapiens (Human)
Description:ChEMBL_1464247
Residue:580
BDBM87573
NameBDBM87573
Synonyms:2,4-Dichloro-N-[4-(pyridin-2-ylsulfamoyl)-phenyl]-benzamide 2,4-dichloro-N-[4-(2-pyridinylsulfamoyl)phenyl]benzamide 2,4-dichloro-N-[4-(pyridin-2-ylsulfamoyl)phenyl]benzamide SMR000612077 | cid_1078173
TypeSmall organic molecule
Emp. Form.C18H13Cl2N3O3S
Mol. Mass.422.285
SMILESClc1ccc(C(=O)Nc2ccc(cc2)S(=O)(=O)Nc2ccccn2)c(Cl)c1