Reaction Details
TargetHigh affinity choline transporter 1
LigandBDBM87577
Substrate/Competitorn/a
Meas. Tech.JHICC_CHT_Inh_3H uptake_CRC
IC50 7505.936168±n/a nM
Citation PubChem, PC JHICC_CHT_Inh_3H uptake_CRC PubChem Bioassay(2012)[AID]
 
High affinity choline transporter 1
Name:High affinity choline transporter 1
Type:PROTEIN
Mol. Mass.:63194.33
Organism:Homo sapiens (Human)
Description:ChEMBL_1464247
Residue:580
BDBM87577
NameBDBM87577
Synonyms:3-[(1-isopropyl-4-piperidyl)oxy]-4-methoxy-N-(1-methyl-2-pyrazin-2-yl-ethyl)benzamide 4-methoxy-3-[(1-propan-2-yl-4-piperidinyl)oxy]-N-[1-(2-pyrazinyl)propan-2-yl]benzamide SMR000659568 | cid_24793875
TypeSmall organic molecule
Emp. Form.C23H32N4O3
Mol. Mass.412.5252
SMILESCOc1ccc(cc1OC1CCN(CC1)C(C)C)C(=O)NC(C)Cc1cnccn1