Reaction Details
TargetHigh affinity choline transporter 1
LigandBDBM87578
Substrate/Competitorn/a
Meas. Tech.JHICC_CHT_Inh_3H uptake_CRC
IC50 3761.879384±n/a nM
Citation PubChem, PC JHICC_CHT_Inh_3H uptake_CRC PubChem Bioassay(2012)[AID]
 
High affinity choline transporter 1
Name:High affinity choline transporter 1
Type:PROTEIN
Mol. Mass.:63194.33
Organism:Homo sapiens (Human)
Description:ChEMBL_1464247
Residue:580
BDBM87578
NameBDBM87578
Synonyms:MLS001101393 N-(2-phenylethyl)-3-(1-propylpiperidin-4-yl)oxybenzamide N-phenethyl-3-[(1-propyl-4-piperidyl)oxy]benzamide cid_24819334
TypeSmall organic molecule
Emp. Form.C23H30N2O2
Mol. Mass.366.4965
SMILESCCCN1CCC(CC1)Oc1cccc(c1)C(=O)NCCc1ccccc1