Reaction Details
TargetHigh affinity choline transporter 1
LigandBDBM87581
Substrate/Competitorn/a
Meas. Tech.JHICC_CHT_Inh_3H uptake_CRC
IC50 864.382655±n/a nM
Citation PubChem, PC JHICC_CHT_Inh_3H uptake_CRC PubChem Bioassay(2012)[AID]
 
High affinity choline transporter 1
Name:High affinity choline transporter 1
Type:PROTEIN
Mol. Mass.:63194.33
Organism:Homo sapiens (Human)
Description:ChEMBL_1464247
Residue:580
BDBM87581
NameBDBM87581
Synonyms:2,4-bis(chloranyl)-N-[4-(3,4,5,6-tetrahydro-2H-azepin-7-ylsulfamoyl)phenyl]benzamide MLS001081265 cid_24979281
TypeSmall organic molecule
Emp. Form.C19H19Cl2N3O3S
Mol. Mass.440.343
SMILESClc1ccc(C(=O)Nc2ccc(cc2)S(=O)(=O)NC2=NCCCCC2)c(Cl)c1