Reaction Details
TargetNuclear receptor coactivator 3
LigandBDBM4212
Substrate/Competitorn/a
Meas. Tech.Counterscreen for inhibitors of the Steroid Receptor Coactivator 1 (SRC1; NCOA1)
IC50 2128±n/a nM
Citation PubChem, PC Counterscreen for inhibitors of the Steroid Receptor Coactivator 1 (SRC1; NCOA1): Luminescence-based cell-based high throughput dose response assay to identify inhibitors of the Steroid Receptor Coactivator 3 (SRC3; NCOA3) PubChem Bioassay(2012)[AID]
 
Nuclear receptor coactivator 3
Name:Nuclear receptor coactivator 3
Type:Enzyme Catalytic Domain
Mol. Mass.:155305.29
Organism:Homo sapiens (Human)
Description:Q9Y6Q9
Residue:1424
BDBM4212
NameBDBM4212
Synonyms:cid_3338791
Typen/a
Emp. Form.C16H15F4N5
Mol. Mass.353.3174
SMILESCn1nc(c(C#N)c1N1CCN(CC1)c1ccc(F)cc1)C(F)(F)F